Notice: Undefined index: HTTP_REFERER in /home/m4gtob8u6p06/public_html/subdirmngr/samarthclasseskudal.com/free-crochet-veafb/5xxxx68gwcukyn.php on line 76

Notice: Undefined index: HTTP_REFERER in /home/m4gtob8u6p06/public_html/subdirmngr/samarthclasseskudal.com/free-crochet-veafb/5xxxx68gwcukyn.php on line 76

Notice: Undefined index: HTTP_REFERER in /home/m4gtob8u6p06/public_html/subdirmngr/samarthclasseskudal.com/free-crochet-veafb/5xxxx68gwcukyn.php on line 76
Execsync command failed

Execsync command failed

execsync command failed 0 using NVM its working correctly. appc run -p ios -T dist-appstore -O . js:657:15). Example of checking for failed exec: const spawn = require('child_process'). Applies to: SQL Server (all supported versions) Azure SQL Database A checkpoint creates a known good point from which the SQL Server Database Engine can start applying changes contained in the log during recovery after an unexpected shutdown or crash. 8 Jan 2017 message: 'Command failed: /bin/sh -c exit 3'. Now we shall see what happens if we do not use try catch for the same operation above. Bug 1683849 - ExecSync 'etcdctl --cert-file /etc/etcd/peer. La risposta di hexacyanide è quasi completa. Each type has its own testing requirements. js:395:35) When I try to create manualy certificates with the command line used by pbiviz and adding quotes (see below), it works ok Hello, I'm currently having a problem when I try to install the module XMPP. Is there supposed to be some obvious evidence of a change in the player? Shouldn’t I see some listing of the media being served by LMS on my Win7 computer. Edit sudo -H gedit /etc/default/grub and change the following line to include this extra parameter. js:641:13) 2019年6月2日 Execute a command line binary with Node. Use of this flag can have a significant negative impact on With training and consulting from SQLskills, you’ll proactively drive your team’s success, rather than just reacting to your database issues. bin/nswag run in the nswag directory. 2019年11月22日 在本地cmd执行命令有效,并且已经配置了环境变量,但是用node. If your node instance does not have that installed, boom! If your node instance does not have that installed, boom! Jul 04, 2019 · at execSync (child_process. 콜백함수는 function(error, stdout, stderr) { } 이다. log(child_process. The dir command will display list of current directory and mkdir command will create a new directory. js:666:15) Complete the following steps to troubleshoot this issue: Ensure that the "ns-server-certificate" and "cert-key" pair are installed on primary and secondary NetScaler and bound to internal service 127. log ('Already up to date. 3 --save --save-exact at checkExecSyncError (child_process. Do not just reduce the server MAXDOP to try to reduce or remove these! Please read the detailed explanations and advice in the links below. 390: 12:06:36: [ERROR] Command [C 2751 Modules verifyMemory "Module_131" "Mem_prog_793" 1268 32] aborted, ModuleName: Command [C 2751 Modules verifyMemory "Module_131" "Mem_prog_793" 1268 32] aborted 12:06:50. + + childProcess. T COMMAND FAILED. /nodebb upgrade Using ubuntu's built in yes command you can force it to answer yes to a particular command, so I edited the start. Please follow the wizard to start your child_process. 04 LTS 64 bit using nodejs v5. log (`stdout: $ {stdout}`); }); console. LOBs may frequently use this wait state. Update the following information: npm ERR! Failed at the MEAN-socket-template@0. x) and later. spawn(command,. 9. conf. js. Even if the first issue is fixed by switching execSync to spawnSync which sanitizes user arguments, a Nov 16, 2020 · There are two distinct types of Cloud Functions: HTTP functions and background functions. This could create security vulnerabilities arbitrary input is also accepted and it could also limit the portability of the app between operating systems. 0 postinstall script. Apr 27, 2018 · 12:06:50. cmd build --watch false webpack is a module bundler. 0 $ ask new. js, having the following code: File: support. 0, MS WORD 2003 and OS IS Windows Server 2003(i have already added Network service account and given full control). Find a pod running on the node you want to target through the previous request. 392: 12:06:50: [INFO] TCF command: Device:endSession sending failed. allocUnsafeSlow(), and new SlowBuffer(size). CSS filters allow you to modify the display of images in a variety of ways, one of those ways being displaying images as grayscale. This message can be caused by exceeding their daily sending e-mail allowance (100 delivered messages via SMTP or 500 delivered messages by their web interface), or by sending a few messages to non existent e-mail addresses. These are the top rated real world C++ (Cpp) examples of Counter from package PySide extracted from open source projects. I primarily enjoy working with Ruby, Rails, C#, and JavaScript but I’m always seeking ways to expand my knowledge and learn about new tools, languages and frameworks. When we have that information, we can then map it to a project. 2: The platform "linux" is incompatible with this module. npm http GET npm http 304 > heap… "ERROR: [Common 17-69] Command failed: Run 'synth_1' has not been launched. spawnSync(command[, args][ Like other synchronous operations in Node. SRM has been installed at both sides. js:487:32) at tryModuleLoad (module. If it opens without crashing after about 15 seconds, then you have a faulty plug in, locate and remove it from your plug-ins folder. 0 with Promise Support message: Command failed: npm install --production stdout: null stderr: null D:\Coding\Web_Project\NodeBB-v1. exe -c. running scripts is disabled on this system; The marking menu shortcuts to context-sensitive commands and tools. '); }); options. Maintainers of this and execSync need better software, or better software documentation. ASA code running in vers Windows: issue: netsh command failed: returned error code 1. js:294:5) at createProject (C:\Users\admin\AppData\Roaming pm ode_modules\react-native-cli\index. npm/_logs/2020-05-08T23_05_32_874Z-debug. replace(/. pdf, . js:630:11) at Object. js(v8. <anonymous> (C:\Données d'applications\cpassuello pm ode_modules\powerbi-visuals-tools ode_modules\commander\index. /_data/QueryFile/qrels. yaml file has three rhel7 pods: 1. Nov 04, 2020 · A note about the is-failed option. This topic describes how to start, stop, or restart the SQL Server Agent Service in SQL Server 2019 (15. jsのchild_process. execSync; const path = `directory path` const EngineQualOutput = execSync (`$ {Path}\ b. This shall help us create applications in Polymer and package them as Android application, which can be installed and run on Android devices, such as, Nexus Phone, Tablet, etc. Press and hold down shift and double click the acrobat icon and then open a pdf file. execSync 的一个例子: execFile( file, args, options, function(error, stdout, stderr) { // command  25 Aug 2019 Then run an exec command and sleep 5000 to make observation SPDY allows for separate stdin/stdout/stderr/spdy-error “streams” to be multiplexed over a single ExecSync runs a command in a container synchronously. info "fsevents@2. ; Side note, if anyone is testing on Windows with Docker Toolbox, you need to run this command to be able to access the site: EXECSYNC. /nodebb, npm, and git commands under the same unprivileged user, which means no sudo. Double click it to import into registry, Right click on any folder, you’ll see there’s a menu which is “Command here”, Click it, you’ll get into the cmd window with the current path is which you selected. For information about the scope of the status value and for status values common to all ActiveSync commands, see section 2. I've tried using the console and the interface, but none of them worked. A. We can use execSync method to run our common line or terminal command, give right path to the mailer Oct 22, 2018 · Hi, I ‘ve got error when I deployed reaction-platform in my MacOS. 9884 Cannot add load isolation property for table with %VSTR defined on The command failed because the source volume is the target of a FlashCopy mapping that is in the specified consistency group. 12" is an optional dependency 注: 次のコードはまだ機能しますが、主にES5以前のユーザーを対象としています。 Node. js:666:15) at Object. 5 or do I have to install the older version? You have managed to mess up the file permissions in the NodeBB directory. I tried it several times; Question Tags: weex krun replied 8 hours ago Brother, at least you can send out a … Aug 23, 2017 · [ERROR] Error: Command failed: npm config get @atlassian:registry [ERROR] 'npm' is not recognized as an internal or external command, [ERROR] [ERROR] operable program or batch file. If it silently fails for a different reason, please create an issue. youtube. load (module. When you’re developing… Occurs after a failed attempt to drop a temporary security key before a retry attempt. Marking menu accessed for objects: UpdateTable operation with the GlobalSecondaryIndexUpdates parameter; What types of troop advancements were involved, and why were both needed I check service status with systemctl status service-name. txt; rm -rf /" to delete the contents of the whole server. /node_modules/. 2 was not found. _extensions. code property will be the exit code of the child process while  child_process. Create JSDoc Configuration Runner. The text in the ERRORLOG gives you the reason. *** Canal Venomplay ***Como Solucionar Hard Disk S. xml file. Unless the --quiet option passed to the systemctl command, this will also print the current unit state to standard message: Command failed: npm install --production stdout: null stderr: null D:\Coding\Web_Project\NodeBB-v1. Thread needs solution . execSync (`dpkg -i ${path} `); // Remove file downloaded. The solution is : Update your node js to the newest version. json. [wait_type] = 'SEC_DROP_TEMP_KEY' then 'Occurs after a failed attempt to drop a temporary security key before a retry attempt. Xcode is IDE for iOS Development developed by apple. 0 Android application using Polymer Starter Kit. js:249:3) Dec 06, 2007 · Add Command here to right button click in explore (Windows XP) Cmd Here. Native Command Queuing (NCQ) is an extension of the Serial ATA protocol allowing hard disk drives to internally optimize the order in which received read and write commands are executed. Sometimes, I want to see full log, from start. never lock the desktop. You should always execute . During child execution in child_process. ')}} catch (e) {console. It has two language one is Objective-C and other one is Swift. js:446:12) Hi all, Below is the problem statement: For device admin purpose, when enable AAA access/Authorization in ASDM, it not allow user to configure the ASA via CLI. If your node instance does not have that installed, boom! 我可以在terminal中运行shell命令,只是在execSync的节点中不起作用。 另外,当我尝试使用OS X附带的命令(如 ls )运行 execSync 时,它运行得非常好… 任何人都可以帮忙吗? Preface Recently, I want to write something to learn about full stack development. Aug 15, 2012 · if only it were that easy. checkHwAccelMethods (/home/Shinobi/libs/ffmpeg. exec() 的同步版本,会阻塞Node. js:579:10) at Module. goes away, but the parallel query select does not go away, which you can see using sp_who2 command. Flash NodeMcu firmware on a ESP8266 board, administer the file system and more. reactioncommerce. plain pod, not priviliged, no /dev bindmount 2. Examples of such areas are bitmaps, large binary objects (LOBs), and the spool iterator. Command Failed. com Anyone know why I get the following error, when I run @hexacyanide's answer is almost a complete one. I sttarted a new one. Apr 23, 2019 · This topic was automatically closed 7 days after the last reply. It seems like nswag doesn't support JObject as input paramter now. 10 check if (!execSync) { execSync = require('sync-exec'); } So if your node instance is older than 0. js:621:11). ' when [W1]. You can then issue the following request with curl: Observe that the program did not terminate abruptly, but continued with the execution of subsequent statements. Here. 10 and is no longer maintained) and execSync (which is dangerous and should not be run outside a development environment) but even both of those feel pretty hacky. Create two js files named support. but, I added the file and edited it directly and this worked on latest ubuntu (whereas adding the user to the sudoers directly did not!) – scape Oct 24 '17 at 13:43 Distributor ID: Ubuntu. Two distinct things are happening here: the nodejs execsync . 2019년 3월 11일 1 require('child_process'). Description: Ubuntu 20. Class: ChildProcess. My application doing download word document it working fine in my development evnironment. ffmpeg. execSync(os. Show 3 replies hard disk: S. Next is to write a script that will execute our jsdoc. Mar 21, 2019 · mongo_1 | 2019-03-21T18:48:52. Plugin store, Easy install and zip install. I have installed nodejs v5. '); }); Note: Certain platforms (macOS, Linux) will use the value of argv[0] for the process title while others (Windows, SunOS) will use command. But if i am deploying // the dotnet test runner will throw exception when there is an assertion failed and causes the // execute the shell command execSync(command, I have the plugin installed on two other units, but I just built a new one to stream to with a HiFiBerry Amp and i cant get the plugin to install regardless of what i do. Aug 26, 2019 · So this isn't an issue of access or a problem with the command, this is an issue with Node executing that command somehow. com is the number one paste tool since 2002. Apr 01, 2019 · I follow this documentation for setting up the reaction commerce docs. Hello, This guide intends to provide Audiophonics ES9018K2M DAC users and especially Rasptouch backers with instructions to get a usable Volumio 2 sound system with volume control. Then go to the Advanced page as shown below. But, now cannot add camera. Aug 13, 2018 · Performance troubleshooting should begin with capturing wait stats so we can understand where SQL Server is busy. The paragraph integrated into IOS was not detailed enough. SECURITY_MUTEX Occurs when there is a wait for mutexes that control access to the global list of Extensible Key Management (EKM) cryptographic providers and the session-scoped list of EKM sessions. 4 Nov 2016 execSync('sh -c "which node"'). execFile(): similar to child_process. EXECUTION_PIPE_EVENT_INTERNAL Mar 13, 2018 · Execute a command on a running container through kubelet. Stavo cercando di capire cosa fosse diverso nei due. diff . M. then display them. Sep 01 09:10:12 draws npm[2340]: npm ERR! at execSync (child Aug 17, 2017 · Many apps need configuration to connect to a database or send requests to error reporting or analytics services. javascript by baruchiro on Jul 10 2020 Hi tcr, following these instructions, I get the following: Invalid DFU suffix signature A valid DFU suffix will be required in a future dfu-util release!!! Cannot open DFU device 1209:7551 No DFU capable USB device available child_process. というエラーが出力された場合、以下の様にexecの引数に{cwd:  8 Jun 2017 If an error occurs during the execution of the command, for example, if we { spawnSync, execSync, execFileSync, } = require('child_process');. Excluding it from installation. If your node instance does not have that installed, boom! If your node instance does not have that installed, boom! I ran the following command and it solved the build issue: watchman watch-del-all; npm start -- --reset-cache Oct 14, 2018 · Hi there, I followed the official doc to install reaction-platform on my laptop, https://docs. Error: 6113, Severity: 16, The distributed transaction associated with UOW %s is in PREPARE state. This shall help us create applications in Polymer and package them as Android application, which can be installed and run on Android devices, such as, Nexus Phone, Tablet, etc. 30 Nov 2016 child_process. Last edited by a moderator: May 29, 2016. js:651 throw err; ^ Error: Command failed: which java 'which' is not recognized as an internal or external command, operable program or batch file. That is to say, if the process handles the SIGTERM signal and doesn't exit, your process will wait until the child process has exited. T. The ALTER DATABASE SET WITNESS command failed. log('Failed to start child process. js:607:13) 0|camera | at execSync (child_process. running the command inside of the react application (console). 1 LTS. cmd, prince. 041 RPi 3 ES9018K2M DAC Official 7" touchscreen plugin Volumio Spotify plugin Balbuze Volspotconnect plugin As Audiophonics does not provide any View archieve failed This file has been truncated, but you can view the full file . CSS filters. For simplicity, let’s break it down. js:616:11) at execSync (child_process. js:628:13) Unlike execSync which is a builtin module, sync-exec is, or was an old module that you have to install explicitly. bat or just prince (I'm no aware of how gems are bundled, but npm bins come with a sh script and a batch script - npm and npm. exec()やexecSyncを使って、OSのコマンドを実行する 方法を紹介します。 child_process. 2 or 2. These other IO-related wait types apply to various other IO Jun 14, 2012 · If so, putting the network name and the password on the command line isn't going to work. execSync (child_process. json execSync@1. execSync(` asciinema upload ${f}`, {encoding: 'utf8'}); return stdout. This feature has both pros and cons: Pros: You can pipe the output of one command as the input to another (just like you could in Linux). Sites created. execSync in node. js Example of checking for failed exec: const spawn = require('child_process'). Database Checkpoints (SQL Server) 04/23/2019; 8 minutes to read +5; In this article. You can also edit the registry, and the steps can be applied to multiple machines using psexec in this way, but I didn’t try that. js 事件循环。 child_process. New replies are no longer allowed. 0 build script 'node -e "console. doesn’t work. Same command. Introduction. 4)の新しいバージョンでも、イベントとコールは古いバージョンと似ていますが、標準の新しい言語機能を使用することをお勧めします。 EXECSYNC: Occurs during parallel queries while synchronizing in query processor in areas not related to the exchange iterator. crt --key-file service failed: rpc error: code = Unknown desc = command error: command timed out,  2016年4月13日 Copied! Error: Command failed: C:\Windows\system32\cmd. datta\Documents\Power BI\Developer>pbiviz --create-cert 'powershell' is not recognized as an internal or external command, Nov 10, 2019 · Site performance testing is super important and being able to do this efficiently is super handy. com. Beginner Posts: 1 Comments: 0 When I tried to backup my exchange server C drive with Acronis Backup ‘nuget’ is not recognized as an internal or external command, operable program or batch file Leave a Reply Cancel reply Your email address will not be published. exe /s /c "foo bar". See full list on dzone. exe, prince. You will need to recursively chown the nodebb directory back over to react react-dom react-scripts cra-template has failed. SQLBrowser: starting up in console mode Auto-suggest helps you quickly narrow down your search results by suggesting possible matches as you type. js:472:13) at Object. The following table lists the status codes for the Sync command (section 2. So we wrap the command execution in a try catch block to ensure the // execute command is fully executed and not exited with code 1 when there is exception thrown from the test try DWQA Questions › Category: Development Tool › Weex tutorial writing is not a problem! 0 Vote Up Vote Down Devillll asked 8 hours ago 1. Bitmap, large binary objects and spooling operations can cause this Reason: Failed to open the explicitly specified database. Nov 28, 2018 · throw new Error('database failed to connect'); Hmm, that seems pretty overwhelming. js child_process. What went wrong: 7 Nov 2020 Use the --scripts-prepend-node-path option to include the path for the node binary npm was executed with. I dragged over 200 emails out of my Outlook 2016 to the "Combine Files" window in order to create one PDF file. There are several IO-related wait types. com/watch?v=hnv8L Nov 19, 2015 · Hi, Let me re-frame my question. F is speed of travel, combine x, y, z using euclidean vec sums. code property will be the exit code of the child process while  25 Apr 2020 If you try to install the new NPM Package for CDS command line tools – @sap/ cds-dk on your local Windows machine you may get this error “npm. execSync  26 Aug 2019 Error: Command failed: curl --request GET --url where the curl command is constructed and then executed using the execSync command. On Windows command prince could be prince. Switch to npm works fine switch back to pnpm it fails. Error: Command failed: npm install react@16. nodejs execsync . If your node instance does not have that installed, boom! If your node instance does not have that installed, boom! Others give the error: Failed to open “alsa” [alsa]; Failed to open ALSA device “hw:1,0”:Device or resource busy. Nov 25, 2011 · Always looking to learn more about *nix world, about the fundamental concepts of math, physics, electronics. I just tried it on three machines, all with python and visual studio, and it failed on each one. I’ve also stopped the process, deleted the Local by Flywheel folder in AppData folder but it did the same when reinstalling. sh: node: command not found exec ( string $command [, array &$output [, int &$return_var ]] ) : string that handles 0, 1, and 2 are standard input, standard output, and standard error. If you are Launches a new process with the given command , with command line arguments in args . May 28, 2018 · let data = ""; const { exec } = require ('child_process'); exec ('echo test', (error, stdout, stderr) => { if (error) { console. It has been tested with the following system configuration : Volumio 2. execSync is a synchronized method that will not return until the child process has fully closed. Pastebin is a website where you can store text online for a set period of time. For linux, you can you ls command to display the current directory list. gradle' line: 3. For Whom: End user. The log of reaction is : reaction_1 | npm WARN react-addons-test-utils@15. Currently only Mac OS is fully supported. x) und höher. What about automating cmd/terminal command. execSync('command', {options}); A connect or send request failed because the connected party did not properly respond after a period of time Pastebin. 604+0000 I REPL [conn1] replSetInitiate admin command received from client reaction_1 | MongoDB replica set initialized and ready. 0 its give me error What's the correct login and password to use when ssh-ing into my rpi4 with a clean installation of HOOBS 3. when trying to configure, It will promopt message of "command authorization failed" For the topology setup: 01. execSync; var fs = require('fs'); // Node 0. . This error can occur for a number of reasons. ILUXA Aspiring Daemon. js:12:15) Hi, As I noticed, it was one of our merged code which was causing the issue. And Occurs when an Always On DDL statement or Windows Server Failover Clustering command is waiting for exclusive read/write access to the runtime state of the local replica of the associated availability group. See the xcrun and xcode-select manualpages for more information. js and master. HEEELLLP! I'm totally new to pnpm and also not a expert regarding deployment so I was wondering, what is the best way to deploy a monorepo? My project right now is using yarn workspaces, one package has next. I have full permissions, correct credentials, and as far as I can tell a good configuration but I continue to see the following errors: Note. js Jun 24, 2019 · Error: Command failed: npm install react@16. privileged pod, no /dev bindmount - but /dev will be populated! C++ (Cpp) Counter - 30 examples found. /dist --pp-uuid "e0f788b0-b321-475e-b859-b97b0a9f828c" --distribution-name "Edufy Sistemas Ltda ME (5L5TMLD7C5)" -l debug { "source": "doc/api/child_process. js:641:13) at Try executing . Jul 23, 2015 · In this article, we will go through the steps to create first Polymer 1. Use these scripts to save yourself some time when doing multiple performance tests. x) SQL Server 2012 (11. spawn; const child = spawn('bad_command'); child. Generated By: Resolver modules. This content has been marked as final. com/docs/installation-reaction-platform. How to fix Many FASTBOOT command errors easily, WATCH FULL VIDEO TO KNOW MORE :-) 👉👉 YOUTUBE VS TIKTOK THE REAL TRUTH : https://www. It will create a new directory also. require ('child_process'). 12 : The platform "linux" is incompatible with this module. Nov 02, 2017 · @hexacyanide’s answer is almost a complete one. log (execSync ('systemctl status emby-server'). Sure, there’s exec-sync (which doesn’t work with node . execSync, the current nodejs event loop is blocked and unable to process output. 0 Source: stackoverflow. Backend may have terminated Author Wei Xu Posted on December 4, 2016 February 14, 2017 Tags console output, execSync, nodejs 1 Comment on Capture console output when using child_process. Just think this, I said we could not automate nodemailer code because of this we are executing in cmd/terminal. execSync (child_process. log Error installing dependencies! message: Command failed: npm install --production stdout: null stderr: null execSync (child_process. reg. js:607:13) at Object. js can be started using the --zero-fill-buffers command line option to cause all newly allocated Buffer instances to be zero-filled upon creation by default, including buffers returned by new Buffer(size), Buffer. 411 and 2. I want to do a simple hello world, I found a groovepi sample with intel edison but obviously that didnt work. Can I force this to use 2. 3. 21). The script below captures wait stats into a table in tempdb; the script should be ran via a Apr 11, 2014 · I was trying, and failing, to install node-heapdump: vagrant@debian7:/vagrant$ npm install heapdump npm WARN package. 자바 스크립트 : define(["require", "exports"], function (require, exports) { /** * Helper to use the Command Line Interface (CLI) easily with both Windows and Unix environments. js:513:13) at doScript (/opt/iobroker/node_modules/. Release: 20. js:533 throw err; ^ Error: Command failed: yarn add less-loader less --save-dev 'yarn' is not recognized as an internal or external command, operable program or batch Apr 20, 2007 · As its name implies, database mirroring uses this wait type for a command queue. js I’m working on a nodejs project recently, and need to execute a command by using child_process. The active developer directory can be set using `xcode-select`, or via the DEVELOPER_DIR environment variable. SRAs installed on both SRM servers. In this example I am changing the value to 4. js:93:24) 0|camera | at /home/Shinobi/libs/ffmpeg. exec() that will block the The error. type()==='Windows_NT'?'ng. 0 postinstall: `node scripts/postinstall` npm ERR! spawn ENOENT npm ERR! npm ERR! Failed at the protobufjs@6. Codename: focal $ ask --version. child_process. This message appears on the console: [npm-cache] [INFO] [npm] r&hellip; var execSync = require('child_process'). cmd <command> instead of mup <command>, or use PowerShell. This means if a query uses a parallel execution plan it will only use four of the available processors. *ls" can not be reached or does not exist. bin Invalid DFU suffix signature A valid DFU suffix will Jul 11, 2020 · This command will publish the plugin on volumio plugins store Error: Command failed: /usr/bin/git push origin master at execSync (child_process. js:26:40) Failed to execute the command. js:631:13) Failed at the bs-platform@1. Prerequisites. A headless Linux Jul 20, 2013 · I came across this issue recently, and after some failed Googling realized that nobody had really solved this very well. Apr 25, 2020 · The command 'cds' has moved from library @sap/cds to @sap/cds-dk. c. 12+ and shelljs - snippets. <uid > at checkExecSyncError (child_process. " The same thing happens regardless of what file type it is - . info fsevents@ 1. Franky LV. js CI, but not consistently execSync should return object with std of plain stdout. on('error', (err) => { console. Dec 04, 2016 · But I could not get the command output in parent process, the returned result always be empty because child_process. 2 requires a peer of Aug 18, 2010 · I am facing problem of COMException (0x800a1066): Command failed My application is uses: ASP. Try launching acrobat in safe mode, to do so follow the steps: a. You can rate examples to help us improve the quality of examples. Alternatively, I could use child_process. Apr 16, 2020 · I am attempting to pickup/push files to a SFTP/SSH server however I am getting a command failure during the transfer and my files are incomplete. 24 Jun 2019 throw err; ^. js:647:13) 0|camera | at Object. After going through several tries (rebooting router, deleting and re-addong sync mod several times , still end up with “command failed to complete” while app is “looking for camera”. Its main purpose is to bundle JavaScript files for usage in a browser, yet it is also capable of transforming, bundling, or packaging just about any resource or asset. Browserify is not recognized as an internal or external command. May 15, 2018 · Wait time should not exceed more than a few seconds, because the server transfers the request to the main query memory pool if it fails to grant the' when [W1]. I started from the familiar react, and the development mode is always in the form of componentscreate-react-appSource code do not understand, need to learn again!Looking for a lot of information on the Internet, swipe the official websiteFind a comprehensive one, butcreate-react-appThe updated … robust cd, execSync wrappers for nodejs 0. aren't yet widely supported but they are indeed impressive and a modern need for web imagery. const cmd = 'd:/Software/ffmpeg Fixed with: yes | . js 評価を下げる理由を選択してください. at Command. line commands only –> after every line command, add an extrusion command calcualte length traveled for that line, divide it by the feedrate –> amt of time travelling for that line multiply that time by the extrusion rate –> distance we. I am having hard time trying to find nodejs samples with the groovepi and pi 3. @mjolnir91: @rfestag just ran into the same issue. but some other commands returns the result as "command failed". The Reaction Platform is the easiest way to run the entire suite of Reaction services at once, as of Reaction version 2. Unlike execSync which is a builtin module, sync-exec is, or was an old module that you have to install explicitly. markdown", "modules": [ { "textRaw": "Child Process", "name": "child_process", "stability": 2, "stabilityText": "Stable", "desc": " [2 / 4] Fetching packages info fsevents@ 2. execSync; var fs = require ('fs'); // Node 0. References: Please see the Command Line Options document for information about different options and ways to run scripts with Node. 10: WARNING: This package has been renamed to @truffle/hdwallet-provider. list itemError: Command failed: npm i --production at checkExecSyncError (child_process. Where: Settings file 'F:\myRNproject\ android\settings. SEQUENTIAL_GUID Occurs while a new sequential GUID is being Describe the problem This problem appears when I want to participate in development , I clone the project javascript stellar-sdk then run npm install What version are you on? 4. 3: Use mz or fs-extra^3. EXE -c import  30 Jul 2020 Error while compiling (offending file last): File '/Users/username/worktest/index. Download the file and unzip the file CMDHere. 2" is an optional dependency and failed compatibility check. log (e. js我正在将一个cli库从ruby移植到node. Thanks in advance and best regards. xls, . com Jan 04, 2017 · Dismiss Join GitHub today. exec() : spawns a shell and runs a command within that shell, passing the execSync() : a synchronous version of child_process. error(err) } else { // the *entire* const { execSync } = require('child_process'); // stderr is sent to stdout of parent process  /home/d/. NET 2. In 47767. execSync function execute(cmd) { exec(cmd, function(error, stdout, stderr) { if (error) { console. { Error: Command failed: npm install --save --save-exact react-native at checkExecSyncError (child_process. exec() except that it spawns the command directly without first spawning a shell. js:657:15) at getFilesUsingBaseAndHead  30 Aug 2018 Run Shell or bash command using Nodejs (err, stdout, stderr) => { if (err) { // some err occurred console. I tried to start it but it failed, so tried to start it from command prompt which failed with below errors. js:249:3) execSync ('systemctl stop emby-server');} // Exec dpkg to install deb. Xcode developer mostly hit by this problem that is “Linker command failed with exit code 1 after installing CocoaPods” it can be occur due to many reasons we will discuss about some of these issues and hope that you will find a way to solve your issue. js instead of browserify . This wait accumulates during certain operations inside parallel queries. If you don't have them already installed, here you can find and download the driver. Are you able to produce a node. exec(): spawns a shell and runs a command within that shell, passing the stdout and stderr to a callback function when complete. bat o semplicemente prince (non sono a conoscenza di come i gemme sono in bundle, ma i npm bin vengono con uno script sh e uno script batch – npm e npm. These wait types do not occur because of regular database page IO operations, because those are covered by the PAGEIOLATCH set of wait types. py --bootstrap (child_process. If one were to execute this in a Unix terminal it would look like: /bin/sh -c "command" execSync will not return until the child process has fully closed. //this works well const execSync = window. If a plugin fails, it might not pass along the error from the core tool, resulting in frustration  4 Dec 2016 I'm working on a nodejs project recently, and need to execute a command by using child_process. Feb 06, 2020 · You can view all command-line options from here. If you want to create a new branch to retain commits you create, you may do so (now or later) by using -b with the checkout command again. 27 Oct 2015 One of the recent errors I encountered was with child_process , whereby an error would occur within an execSync command and the entire app  try { execSync(`cd ${directory} && npm install --unsafe-perm`, { execSync(command[, options]); child_process. Node. Pastebin. 10 check if (!execSync) { execSync = require ('sync-exec'); } So if your node instance is older than 0. プログラミングに関係のない質問 やってほしいことだけを記載した丸投げの質問 問題・課題が含まれていない質問 意図的に内容が抹消された質問 過去に投稿した質問と同じ内容の質問 広告と受け取られるような投稿 The amount of passed/failed displays in the "Tests" panel, but te report doesn't. I have a large hard drive, 90% of which is available. Not to my surprise I found that SQL Browser service was in a stopped state. ” and apply. 04. Error: Command failed: . error(error, stderr) } else { console. The ideal solution should:  14 Nov 2018 One can execute Linux, git shell commands from node script using node's function run(cwd, command) { return execSync(command, { cwd,  4 Jun 2019 14:48:55 Error: An error occurred while trying to start the Nightwatch Runner: Error: Error while running "getCookies" command: Command failed: php . If the END CATCH statement is the last statement in a stored procedure or trigger, control is passed back to the statement that called the stored procedure or fired the trigger. Something like this is much better served by Dagger's upcoming SPI where a JSON file can be natively generated and then rendered separately, so hopefully we can see that soon. toString ());} else {console. You can look around, make experimental changes and commit them, and you can discard any commits you make in this state without impacting any branches by performing another checkout. But when i try to build it on ubuntu 16. Create a file in \lib\tasks\generateJsDoc. 방금 Cli 도우미가 Unix / Windows를 쉽게 다룰 수 있도록 썼습니다. When a timeout has been encountered and killSignal is sent, the method won't return until the process has completely exited. file = '/bin/sh'; args = ['-c', command]; This is eventually executed on Linux and OS X by libuv using execvp without further modification of the arguments (On Windows, libuv calls quote_cmd_arg on each argument if windowsVerbatimArguments is true). R. mongo_1 | 2019-03-21T18:48:52. exe -a0 -d 1209:7551 -D firmware-winusb. exe -q`, { windowsHide: true, shell: true }); >> VS1NQktJTS1XMFgxb (as same as running in cmd window directly) //but this one doesn't work const EXECSYNC wait type? – Learn more on the SQLServerCentral forums. You can run these inline, and using the same console output as your script, if you send “stdio” as an argument to execSync. sh script and forced it to answer yes to anything with prompts, would be great for this to be added to the official scripts if possible! Mar 02, 2018 · Unlike execSync which is a builtin module, sync-exec is, or was an old module that you have to install explicitly. This will only take a moment. browserify is installed, but is not available in it in a shell command, which means the attacker can add whatever they want to the end of the command and it will be executed. I hope you got my point, let's automate the cmd/terminal command for nodemailer. js, the other one is nodejs with graphql an other things, there's also packages for common things and they are all using typescript as well May 27, 2016 · "failed to execute Login command" remains the same. 5. Hence I was facing this issue. CMMVC6312E The command failed because the target volume is the source of a FlashCopy mapping that is in the specified consistency group. This module depends on SiLabs USB to UART bridge drivers. Event: 'close'; Event: 'disconnect'; Event: 'error'  Note that the exit -event may or may not fire after an error has occurred. zwave-936e120a/lib/preinstall. killed: false, execSync , except the default encoding is utf8 instead of buffer . If the operation failed, the Status element contains a code that indicates the type of failure. 04 LTS 64 bit. npm ERR! Failed at the webapp@0. You can place this file anywhere but it’s better to have it under lib outside our webapp directory. What is the update method when you choose to update any server? From non compliant systems there is a need to choose to either OMSA update method or iDRAC update method. log('success', stdout) } }) } execute('npm run dev') Feb 19, 2019 · Let’s create a simple Python script that will take two command line arguments as a first name and last name. at checkExecSyncError ( child_process. bat or just prince (I’m no aware of how gems are bundled, but npm bins come with a sh script and a batch script – npm and npm. 22 Aug 2020 It allows to execute arbitrary commands on the victim's PC. js:507 throw err; ^ Error: Command failed: dfu-util-static. txt . Aug 14, 2017 · Hello, I was installing Local by Flywheel today and it almost immediately skipped the virtual box step because I already have that one installed (latest version) but it keeps being stuck on the 2nd step “Host machine”. Tried to flatten didn't fix it. exec() except that it spawns the command directly without first spawning a shell by default. js。在我的代码中,我在必要 child_process. js:607:13) at execSync  2018年6月25日 node. 1 // the dotnet test runner will throw exception when there is an assertion failed and causes the // test exited with code 1. Que fica pedindo para pressionar F1 para inicializar o sistema operacional do seu See full list on krasimirtsonev. Later we’ll run that script from Node JS application and display output in the browser window. Feb 20, 2006 · When I receive email attachments, I can open, print or save the small ones. 11 Feb 2020 Error: Command failed: git merge-base master HEAD fatal: Not a valid execSync (child_process. checkVersion (/home/Shinobi/libs/ffmpeg. This is because "foo bar" isn't passed with the quotes to docker-compose. js:526 throw err; ^ Error: Command failed: _data\bin\ trec_eval_Windows . That worked out fine. 'which' is not recognized as an internal or external command, operable program or batch file. [ERROR] [ERROR] [ERROR] at checkExecSyncError (child_process. I want to run Cypress on AWS Lambda in the context of a CI/CD pipeline, because this would open the door to parallelizing the crap out of my end-to-end tests, severely limiting that compounding slowness. It could have 1000s of rows. 評価を下げる理由を選択してください. 20. NULL) { g_error ("Spawning child failed: %s", error->message); return; } // Add a child program only if it uses wide character API to retrieve its command line. exec(command[, options][,  9 Sep 2018 Error: Command failed: yarn add react-native --exact. 2. toString());` that's the error i get :frowning: It's a dmg app built with electron-builder and the same command  execSync(command[, options]); child_process. js which responds with 'Hello World': Aug 10, 2017 · After completing the steps at both sites, ensuring only HTTPS is used throughout the errors have gone away and SRM is happy once more and the dreaded “SRA command discoverArrays failed” and “Failed opening session for user to site mgmt IP” are gone. js, if an error occurs, it will throw. But can not Jul 13, 2018 · Package install failed, see above. 0. Check the network address name and that the ports for the local and remote endpoints are operational. This is the case for many of the login failed states but you can only see this in the ERRORLOG as an admin. /configure. I tried all different installation methods. js:666:15) Failed to execute Fdo command This may not be an AutoCad Map problem but I will throw it out anyway. Probably just going to stick with npm till someone figured out the issue. Example # An example of a web server written with Node. 1-pre No repository field. Il prince command di Windows potrebbe essere prince. npm ERR! This is probably not a problem with npm. Gilt für: SQL Server 2012 (11. Buffering the Output means that the output of the command is loaded into the memory before sending to stdout or stderr and as mentioned above a default of 200KB can be buffered into the memory. execSync will not return until the child process has fully closed. exec의 동기 버전인 execSync가 있다. Sembra che l’ambiente fosse diverso. 0)に詳しく説明されています。 Oct 06, 2016 · child_process. execSync; exec('npm run dev', {stdio: 'inherit'}); #Other references var exec = require('child_process'). staging/iobroker. There is likely additional logging output above. Error: Command failed: sudo apt-get install libudev-dev -y /bin/sh: 1: sudo: not found! at checkExecSyncError (child_process. error (`exec error: $ {error}`); return; } data = stdout; console. A function's test structure depends on which Google Cloud resources that function uses. browserify is installed, but is not available in command line, 'browserify' is not recognized as an internal or external command npm uninstall browserify --save npm install browserify -g npm install browserify-shim -- save node_modules\browserify\bin\cmd. It’s stuck on there for hours now. La fase di compilazione richiede l’impostazione della variabile env HOME. Unable to open" Attached you can find the log file. I'm on FreeBSD 10. I have setup a portion of the inventory mappings, but have not One can execute Linux, git shell commands from node script using node’s child process API like exec, execSync. some commands works on react as same as running in cmd directly. js:512:13) at Object. 衍生shell,然后在shell 中执行 command ,并缓冲任何产生的 输出。 如果提供了 callback 函数,则调用时会传入参数 (error, stdout, stderr) 。 当成功  These build tools rely on plugins that wrap a core command line tool. js:72 throw e; ^ Error: Command failed: npm install --production at checkExecSyncError (child_process. info "fsevents@1. プログラミングに関係のない質問 やってほしいことだけを記載した丸投げの質問 問題・課題が含まれていない質問 意図的に内容が抹消された質問 過去に投稿した質問と同じ内容の質問 広告と受け取られるような投稿 It's based on very simple regex which doesn't work if you don't follow its naming conventions even in Java (let alone using something like @Binds). installAll  15 Aug 2019 configure error gyp ERR! stack Error: Command failed: C:\Users\manul\AppData\ Local\Programs\Python\Python37-32\python. '); }); var execSync = require ('child_process'). generateJsDoc. I am also passionate about programming, database and systems administration. Fix npm run env:install not setting the correct port for the site URL on Windows. js:472:13) at execSync (child_process. js:473:13) at Object. 413. js (module. Tried the following steps, but didn’t work: deleting npm , npm-cache folders from C:\Users\Username\AppData\Roaming 2)uninstall node js reboot 4)install again reboot run command “npm install -g @angular /cli” reboot npm run env:cli option update blogname "foo bar" currently fails with "Error: Too many positional arguments: bar". 1. GitHub is home to over 50 million developers working together to host and review code, manage projects, and build software together. jsを使って子プロセスを生成するためのモジュールは documentation (v5. execSync(cmd, { stdio: 'inherit You need to start I finally solved it by writing a photoshop exit code inside the jsx file and it closed the photoshop and given me a success code. C:\Program Files (x86)\Microsoft SQL Server\90\Shared>sqlbrowser. CMMVC6313E The command failed because the specified background copy rate is invalid. Active 5 months ago. log (data); OUTPUT: stdout: test. Here is the details of my error: C:\Users ilotpal. It is recommended to remove the global version of @sap/cds and reinstall @sap/cds-dk via npm rm -g @sap/cds npm i -g @sap/cds-dk The next time the app loads, I could tell it to read the state from the file. Remedy: Do not issue the command as it is a load isolated table already. await unlink (path); // Restart the server. It - 8740307 When you run the Set-MsolADFSContext -Computer command in the Microsoft Azure Active Directory Module for Windows PowerShell, you receive the following error: Set-MsolADFSContext : The connection to <ServerName> Active Directory Federation Services 2. x\src\cli\package-install. Returns the same  3 Jun 2016 buffered data when the command executes successfully; error (which is an instance of Error) when the command fails. /_results/test_query. Here is what our JS function to convert the An ESP8266 command line interface. Capito. 10, it will fallback to require sync-exec . Viewed 6k times 0. NETCore. Feb 27, 2018 · so, this is what I get when running this with latest cri-o, it seems either a misconfiguration or a network issue, not a crio issue for liveness probe :/ Mar 10 13:13 npm ERR! file sh npm ERR! code ELIFECYCLE npm ERR! errno ENOENT npm ERR! syscall spawn npm ERR! protobufjs@6. 2. x) by using SQL Server Management Studio. By default, I see few rows only, so I add -n50 to see more. We can check whether any of the specified units or services are in a “failed” state under Linux. The following command returns an exit code 0 if at least one has failed, non-zero otherwise. py ', line Error: Command failed: python3 -m transcrypt --nomin --map --verbose " index" at execSync (child_process. IO Wait Types. js:128:20 0|camera | at Object. execSync(). For example, the attacker can provide a filename of "hello. js:591:13) at Object. 1 start…ript. js:652:15) at executeCommand (/Users/mohansagar/nativeCli/EmployeeDatabase/employeeDatabase/node_modules/ @react-native-community /cli/build/tools/PackageManager. Jan 10, 2020 · I recently changed my wifi pw, so had to establish comms with sync module. execSync to call an arbitrary shell command. Use KILL UOW WITH COMMIT/ROLLBACK syntax to kill the transaction instead. allocUnsafe(), Buffer. js:570:32) at Object. Oct 12, 2020 · In the affected-projects-marker. exec() example 2. The first thing you should do is to make sure that you are Issue 1: Acrobat failed to send DDE command . com Install with Reaction Platform · Reaction Docs. doc etc. execSync ('systemctl start emby-server'); console. spawnSync(command[, args][, options]). js file that will execute that curl command at all? It might be a problem with execSync versus exec or something on that particular version of node?!?! I don't really know enough about node to Oct 27, 2015 · Display Images as Grayscale with CSS Filters. spawn; const subprocess = spawn('bad_command'); subprocess. 6. 3:41958 (0 connections now open) Oct 19, 2016 · The plugins can be added to the project by running the command cordova plugin add [PLUGIN_NAME], but this means that we have to include the plugins directory in the SCM and there is a better alternative by adding it in the config. js:88:9) Sep 16, 2019 · [Execute command] Error: Command failed: npm install npm WARN deprecated truffle-hdwallet-provider@1. Codota search - find any JavaScript module, class or function { Error: Command failed: npm install --save --save-exact react-native at checkExecSyncError (child_process. ? Using the HOOBS administrative user I created when setting up doesn't work. Applies to: SQL Server 2012 (11. const { execSync } = require('child_process'); // stderr is sent to stderr of parent exec(cmd, function(error, stdout, stderr) { // command output is in stdout });. Tried clearing cache, and running the command again. 最近では、Visual Studio Code に慣れて便利に使っている。 しかし、突然出力コンソールの日本語文字化けが発生。何かと思ったら、Arduinoプラグインがupdateされたみたいだ。 これは、導入したときにも発生していてファイルにパッチを充てることで回避したが今回はまた上書きされてしまった The --force-fips command-line argument was used but there was an attempt to enable or disable FIPS mode in the crypto module. , The witness server instance name must be distinct from both of the server instances that manage the database. main  6 Mar 2020 not initialized Error: Command failed: git --version. Created attachment 1507319 rhel7 pods with combinations of privileged option and /dev bind-mount This attached . js script we use the git diff command git diff HEAD HEAD~ --name-only to get all of the paths of files that are modified. So we wrap the command execution in a try catch block to ensure the Okay, so I changed the slashes and now I get that it is looking for Microsoft. cmd). failed command: WRITE FPDMA QUEUED - cause of server running slow? Ask Question Asked 1 year, 9 months ago. detached Explanation: An ALTER TABLE command is issued to alter the specified table to be a LDI table. message); Additional dependencies must be installed. 'yarn' is not recognized as an internal or external command, operable program or batch file. Using either Map 2008 or 2009, in Data Connect, connect to a WFS service (Geoserver with PostGIS database). js:666:13) 10:55:03 PM (Executor) at Object. js的execSync活 exec方法执行就报错或乱码:Error: Command failed: 1 Apr 2019 But when I did this command, it gives me an error cd reaction reaction_1 | { Error: Command failed: execSync (child_process. 25 Mar 2020 FAILURE: Build failed with an exception. // the dotnet test runner will throw exception when there is an assertion failed and causes the // test exited with code 1. Hi, Also the rotary encoder plugin doesn’t work with v2. 16+ yrs experience in software development, designing enterprise systems, IT support and troubleshooting. javascript by Misty Manatee on Jun 11 2020 Donate . Example of checking for failed spawn: const { spawn } = require('child_process'); const subprocess = spawn('bad_command'); subprocess. [CLIENT: <local machine>] So no longer do you need to know what the State number means (in fact noticed the State number has changed). [wait_type] = 'SECURITY_MUTEX' then 'Occurs when I’m Martin Brennan, and I’m a full stack software engineer based in Australia. press f1 to resume) samsung hard disk IDE 40 gb sv4002h lba 78,242,976 how could i solve this problem when i testing with es tool software smart hard drive is Mar 15, 2019 · One of the things that sucks about end-to-end tests is that they're slow to run, and this slowness compounds as teams and test suites grow. Whenever I get a large attachment (< 100K) and try to open, save or forward it, I get "Command failed to execute. npm WARN deprecated fs-promise@2. gcode tutorial G28 – Perform Homing And do you think this is the cause of all my trail's status is waiting all the time? Pastebin. 14. _compile (module. But when you want to save the return value outside of the function scope, one must If you are using Command Prompt on Windows, make sure you run commands with mup. However, the table is already a load isolated table. ERR_CRYPTO_FIPS_UNAVAILABLE An attempt was made to enable or disable FIPS mode, but FIPS mode was not available. or directory: '; touch HACKED' Uncaught Error: Command failed: asciinema upload  child_process. 8. <anonymous> (/root/nodebb/nodebb:17:9) at Module. Getting Started There are couple of things that we… I am using Adobe Acrobat Pro XI. js:616:11) at execSync  execSync() : child_process. js:612:13) Command `yarn add react-native — exact` failed. Module. 0 server failed due to invalid credentials. I implemented a static method that takes two input parameters: (1) script/ command (2) args to be passed Flaky tests are tests that fail occasionally in the Node. Dec 19, 2016 · Find and execute the named command line tool from the active developer directory. Within SSMS, right click on a registered server and select Property. 609+0000 I NETWORK [conn1] end connection 172. js:588:13) [ERROR] at Object. log('Failed to start subprocess. 2 . Apr 06, 2012 · run command: control userpasswords2 Select the account from the list, uncheck the “Users must enter a user name and password to use this computer. App version 1. Nov 12, 2012 · Below shows the T-SQL command that you can run to change the value. If it var exec = require('child_process'). You'll either have to use a trusted connection or set up a separate ID with SQL Server Authentication. 0 To Reproduce Jul 29, 2019 · Change the JS code to call the GhostScript command to convert the PDF (sample below, command here) Upload the new code to lambda and make sure everything still worked (it did!) The answer on the StackOverflow question above is similar to the process I followed but I didn’t bother with lambda layers. Error: 6114, Severity: 16, Distributed transaction with UOW %s is being used by another user. Description. KILL command failed. at execSync (child_process. I have setup and install kolibri on ubuntu 14. The parallel threads wait while the construct is built with a single thread, and all accrue EXECSYNC. js:512:13) at run (C:\Users\admin\AppData\Roaming pm ode_modules\react-native-cli\index. txt at  5 Apr 2020 err; ^ Error: Command failed: ls; asdf zsh:1: command not found: asdf at checkExecSyncError (child_process. , The server network address "%. b. the echo command failed, even though i'm root. here is a sample 0|camera | Uncaught Exception occured! 0|camera | Error: Command failed: undefined -loglevel quiet -hwaccels 0|camera | /bin/sh: undefined: command not found 0|camera | at checkExecSyncError (child_process. 28. execsync command failed

hffl1, nvp, hg1, v5l, 9diq, rw5q, pgg, xz, f9az, bt, 94i, ckmc, ak, kypc, n8y,